{"text_format":"1","workbook":"xlsx","n_sheets":8,"sheets":["Calculadora","Nomina","Resumen","Datos","Recibo","Plantilla","D-basicos","Hoja1"],"not_rendered":{"charts":0,"images":3,"macros":1,"external_links":2,"defined_names":48,"comments":2,"pivot_tables":0},"unopened":[],"bounds":{"document_bytes":16777216,"sheet_cells":100000,"rows_first":2000,"rows_last":500,"rows_between":2000,"halvings":0,"cell_chars":16384,"cell_head_chars":4096},"cells_cut":0,"cells_raw":0,"read":"whole","date_system":"1900"}

{"sheet":"Calculadora","index":0,"n_rows":8,"n_cols":3,"rows_kept":8,"cut":false,"hidden":false,"merged":[]}
[null,4,2]
[1]
[2]
[]
[5]
["NIT: 12345"]
["carre 30 # 44-55 Medellin"]
[3345520]

{"sheet":"Nomina","index":1,"n_rows":65,"n_cols":88,"rows_kept":65,"cut":false,"hidden":false,"merged":[[2,53,2,60],[0,16376,1,16379],[1,15,1,16],[1,18,1,22],[1,25,1,34],[1,54,1,60],[2,25,2,34],[2,3,2,15],[2,17,2,22],[2,36,2,47],[2,49,2,52]]}
[null,null,null,null,{"$f":"'D-basicos'!$B$5","v":106454},{"$f":"'D-basicos'!$B$4","v":908526},{"$f":"'D-basicos'!$C$40","v":1.35},{"$f":"'D-basicos'!$C$46","v":2.1},{"$f":"'D-basicos'!$C$41","v":1.25},{"$f":"'D-basicos'!$C$42","v":1.75},{"$f":"'D-basicos'!C44","v":2},{"$f":"'D-basicos'!$C$45","v":2.5},{"$f":"'D-basicos'!$C$43","v":1.75},{"$f":"'D-basicos'!$C$43","v":1.75},null,null,{"$f":"'D-basicos'!$B$15","v":0.04},{"$f":"'D-basicos'!$B$16","v":0.04},{"$f":"'D-basicos'!$B$19","v":0.01},{"$f":"'D-basicos'!$B$20","v":1.2E-2},{"$f":"'D-basicos'!$B$21","v":1.4E-2},{"$f":"'D-basicos'!$B$22","v":1.6E-2},{"$f":"'D-basicos'!$B$23","v":1.7999999999999999E-2},{"$f":"'D-basicos'!$B$4","v":908526},{"$f":"'D-basicos'!$B$5","v":106454},{"$f":"'D-basicos'!$B$8","v":8.3299999999999999E-2},{"$f":"'D-basicos'!$B$9","v":8.3299999999999999E-2},{"$f":"'D-basicos'!$C$10","v":0.12},{"$f":"'D-basicos'!$C$15","v":8.5000000000000006E-2},{"$f":"'D-basicos'!$C$16","v":0.12},{"$f":"'D-basicos'!$B$49","v":0.02},{"$f":"'D-basicos'!$B$50","v":0.03},{"$f":"'D-basicos'!$B$51","v":0.04},{"$f":"'D-basicos'!$C$28","v":5.1999999999999998E-3},{"$f":"'D-basicos'!$B$11","v":4.1700000000000001E-2},{"$f":"Cesantias","v":386771.24},{"$f":"Prima","v":386771.24},{"$f":"Int","v":3867.7123999999994},{"$f":"Salud","v":359018.75},{"$f":"Pension","v":506850},{"$f":"Sena","v":84475},{"$f":"Icbf","v":126712.5},{"$f":"Caja","v":168950},{"$f":"Arp","v":21963.5},{"$f":"'D-basicos'!$C$15","v":8.5000000000000006E-2},null,{"$f":"SUM(AJ1:AL1)","v":777410.19239999994},{"$f":"$AO$1+$AP$1+$AQ$1","v":380137.5},{"$f":"SUM(AU1+AV1)","v":1157547.6924000001},{"$f":"Vaca","v":176130.38},{"$f":"SUM(AM1:AN1)+$AR$1","v":887832.25},{"$f":"SUM(AO1:AQ1)","v":380137.5},{"$f":"($AX$1+$AL$1+$AK$1+$AJ$1)","v":953540.57239999995},{"$f":"($BA$1+$AZ$1+AY1)","v":2221510.3223999999},{"$f":"'D-basicos'!$B$66","v":2684000},{"$f":"'D-basicos'!$C$30","v":31859},{"$f":"'D-basicos'!$C$70","v":0.16},{"$f":"'D-basicos'!$D$70","v":0.25},{"$f":"'D-basicos'!D72","v":0.3},{"$f":"'D-basicos'!$B$72","v":8500000},{"$f":"'D-basicos'!$B$66","v":2684000},{"$f":"'D-basicos'!$B$68","v":858912},{"$f":"'D-basicos'!$D$68","v":0.1},null,{"$f":"'D-basicos'!$B$73","v":6442000},{"$f":"'D-basicos'!$D$73","v":0.25},{"$f":"'D-basicos'!$D$75","v":0.08},{"$f":"'D-basicos'!$C$77","v":1100481},{"$f":"SUM(F6,F7:F66)","v":3950000},{"$f":"SUM(G6,G7:G65)","v":409940},{"$f":"SUM(BB6,BB7:BB66)","v":33750.000000000007},{"$f":"SUM(BC6:BC66)","v":240000},{"$f":"SUM(BI6:BI66)","v":83750},{"$f":"SUM(BL6:BL66)","v":0},{"$f":"SUM(P6:P66)","v":0},{"$f":"SUM(S6:S66)","v":168950},{"$f":"(BX1*2)","v":337900},{"$f":"SUM(U6:U66)","v":0},{"$f":"SUM(AO6:AO66)","v":0},{"$f":"SUM(AL6:AL66)","v":0},{"$f":"SUM(AM6:AM66)","v":0},{"$f":"SUM(AN6:AN66)","v":0},{"$f":"SUM(AP6:AP66)","v":0},{"$f":"SUM(AQ6:AQ66)","v":0},{"$f":"Calculadora!$A$7","v":"carre 30 # 44-55 Medellin"},null,{"$f":"Calculadora!$A$8","v":3345520},{"$f":"'D-basicos'!$C$83","v":3826000}]
[{"$f":"TODAY()","v":"2021-01-08"},{"$f":"Calculadora!$A$6","v":"NIT: 12345"},null,null,null,null,null,null,null,null,null,null,null,null,null,"TOTAL NETO PAGADO",null,{"$f":"Neto","v":4305212},{"$f":"CONVIERTENUMLETRA(R2)","v":"CUATRO MILLONES TRESCIENTOS CINCO MIL DOSCIENTOS DOCE PESOS 00/100 M.N."},null,null,null,null,null,null,"PROYECCIÓN APORTES PARAFISCALES Y OTRAS APROPIACIONES"]
[null,null,null,"DEVENGADO",null,null,null,null,null,null,null,null,null,null,null,null,null,"DEDUCIONES",null,null,null,null,null,null,null,"APROPIACIONES",null,null,null,null,null,null,null,null,null,null,"CAMPOS VARIADOS",null,null,null,null,null,null,null,null,null,null,null,null,"BASE DE DATOS",null,null,null,"GENERICOS"]
[{"$f":"YEAR(A2)","v":2021},"EMPLEADO",null,"Sueldo Basico","Dias T","Basico","AT","RN","RNF","HED","HEN","HEFD","HEFN","HOF","Factor Salarial","No Constituyen Salario","Total Devengado ","Salud","Pension","Fondo de Solidaridad","RT","Otras Deduciones","Total Deducciones","Neto Pagado",null,"Cesantias","Prima de Servicios","Int. S/Cesantia","Salud","Pension","Sena","ICBF","Caja de Compensanción","ARP","Vacaciones","Laborados","CARGO","Genérico1","Genérico2","Genérico3","Genérico4","Genérico5","Genérico6","Faltas","Genérico7","Genérico8","Genérico10","Genérico11",1,"Nª","Numero","Salario","Generico 12","Generico 13","Generico 14","Generico 15","Generico 16","Generico 17","Generico 18","Generico 19","Generico 20","I.d","Antigüedad","CANTIDAH","EMPLEADOS",null,null,null,"C.C","CCID","Antigüedad","cc","id"," R","VACACIONES ","DIAS ","CESANTIAS ","Dias ","INT CESSANTIAS ","DIAS ","Prima","DIAS "]
[null,"Formulas ",null,0,0,{"$f":"ROUND(+D5/30*E5,3)","v":0},{"$f":"IF(D5=0,0,IF(D5<=2*'D-basicos'!$B$4,'D-basicos'!$B$5/30*Nomina!E5,0))","v":0},{"$f":"(D5/240)*(1 *'D-basicos'!$C$40)","v":0},{"$f":"(D5/240)*(1*'D-basicos'!$C$46)","v":0},{"$f":"(D5/240)*(1*'D-basicos'!$C$41)","v":0},{"$f":"(D5/240)*(1*'D-basicos'!$C$42)","v":0},{"$f":"(D5/240)*(1*'D-basicos'!$C$44)","v":0},{"$f":"(D5/240)*(1*'D-basicos'!$C$45)","v":0},{"$f":"(D5/240)*(1*'D-basicos'!$C$43)","v":0},0,0,{"$f":"SUM(F5:P5)","v":0},{"$f":"(Q5-P5-G5)*'D-basicos'!$B$15","v":0},{"$f":"(Q5-P5-G5)*'D-basicos'!$B$16","v":0},null,null,null,{"$f":"SUM(R5:V5)","v":0},{"$f":"Q5-W5","v":0},null,{"$f":"(Q5-P5)*'D-basicos'!$B$8","v":0},{"$f":"(Q5-P5)*'D-basicos'!$B$9","v":0},{"$f":"(Z5*E5*'D-basicos'!$C$10)/360","v":0},{"$f":"(Q5-P5-G5)*'D-basicos'!$C$15","v":0},{"$f":"(Q5-P5-G5)*'D-basicos'!$C$16","v":0},{"$f":"(Q5-P5-G5)*'D-basicos'!$B$49","v":0},{"$f":"(Q5-P5-G5)*'D-basicos'!$B$50","v":0},{"$f":"(Q5-P5-G5)*'D-basicos'!$B$51","v":0},{"$f":"(Q5-G5-P5)*'D-basicos'!$C$28","v":0},{"$f":"(Q5-G5-P5)*'D-basicos'!$B$11","v":0}," das laborados",null,"Aportes Adicionales Salud, UPC","Aportes voluntarios al Fondo de Pensiones","Descuento por Aportes AFC","Descuentos Por Prestamo","Descuentos Por Aportes a cooperativas ","Descuentos Por Embargos","Diás de descanso, Incapacidad, licencia y no trabajados","Excusa","RUTA","Prestación Económica por Incaoacidad  o Licencia ","Vacaciones ","D:\\Trabajos JEGE\\Aleja\\ALEJANDRA\\Articulos\\imagenes\\Imagen21.jpg",null,"UR","Salario Basico","CARGO","RN","Comisiones","Factor Salarial","1º faltas","2ºfaltas","3ºfaltas","4ºfaltas","Total HE",null,null,"Bonificaciones Y Primas",null,null,null,null,null,"cc","antigüedad",null,null,"RWCARGO NOCTURNO",null,null,null,null,null,null,null,null,null,null,"Aportes Parafiscales",30]
["Enero","Carolina Bargas ",null,950000,30,950000,100000,0,0,0,0,0,0,0,0,0,1050000,38000,38000,0,0,0,76000,974000,null,87465,87465,874.65,80750,114000,19000,28500,38000,4940,39615,30,"Analista ",0,0,0,0,0,0,0,null,"",null,null,"",1,"Yeny Bastidas",1000000,"Secretaria",{"$f":"SUM(H6:I6)","v":0},0,0,null,"/0/0","/0/0",null,{"$f":"SUM(H6:N6)","v":0},".01","2008-04-05",0,{"$f":"AY6","v":"Yeny Bastidas"},{"$f":"AZ6","v":1000000},{"$f":"BA6","v":"Secretaria"},{"$f":"BK6","v":"2008-04-05"},39567345,"CÉDULA DE CIUDADANÍA","02/02/2012","39256348","CÉDULA DE CIUDADANÍA",0,0,0,0,0,0,0,0,0]
["Enero","Yeny Bastidas",null,1000000,30,1000000,97032,0,0,0,50000,0,0,0,100000,0,1206454,44000,44000,0,0,0,88000,1118454,null,100497.62,100497.62,1004.9761999999997,93500,132000,22000,33000,44000,5720,45870,30,"Secretaria",0,0,0,0,0,0,0,null,"",null,null,"",2,null,null,null,{"$f":"SUM(H7:I7)","v":0},100000,0,null,"/0/0","/0/0",null,{"$f":"SUM(H7:N7)","v":50000},".02",null,0,{"$f":"AY7","v":0},0,0,{"$f":"BK7","v":"00:00:00"},null,null,"05/04/2008","39567345","CÉDULA DE CIUDADANÍA",0,0,0,0,0,0,0,0,0]
["Enero","Yeny Bastidas",null,1000000,30,1000000,106454,16875.000000000004,0,0,0,0,0,0,40000,0,1163329,42275,42275,0,0,0,84550,1078779,null,96905.31,96905.31,969.05309999999997,89834.375,126825,21137.5,31706.25,42275,5495.75,44071.69,30,"Secretaria",0,0,0,0,0,0,0,null,"",null,null,"",3,null,null,null,16875.000000000004,40000,0,null,"/0/0","/0/0",null,16875.000000000004,".03",null,0,null,0,0,"00:00:00",null,null,"05/04/2008","39567345","CÉDULA DE CIUDADANÍA",3,0,0,0,0,0,0,0,0]
["Enero","Yeny Bastidas",null,1000000,30,1000000,106454,16875.000000000004,0,0,0,0,0,0,100000,0,1223329,44675,44675,0,0,0,89350,1133979,null,101903.31,101903.31,1019.0330999999999,94934.375,134025,22337.5,33506.25,44675,5807.75,46573.69,30,"Secretaria",0,0,0,0,0,0,0,null,"",null,null,null,4,null,null,null,16875.000000000004,100000,0,null,"/0/0","/0/0",null,16875.000000000004,".04",null,0,0,0,0,"00:00:00",null,null,"05/04/2008","39567345","CÉDULA DE CIUDADANÍA",3,0,0,0,0,0,0,0,0]
[null,null,null,null,null,null,null,null,null,null,null,null,null,null,null,null,null,null,null,null,null,null,null,null,null,null,null,null,null,null,null,null,null,null,null,null,null,null,null,null,null,null,null,null,null,null,null,null,null,5,null,null,null,0,null,null,null,null,null,null,0,".05",null,null,0,0,0,"00:00:00"]
[null,null,null,null,null,null,null,null,null,null,null,null,null,null,null,null,null,null,null,null,null,null,null,null,null,null,null,null,null,null,null,null,null,null,null,null,null,null,null,null,null,null,null,null,null,null,null,null,null,6,null,null,null,0,null,null,null,null,null,null,0,".06",null,null,0,0,0,"00:00:00"]
[null,null,null,null,null,null,null,null,null,null,null,null,null,null,null,null,null,null,null,null,null,null,null,null,null,null,null,null,null,null,null,null,null,null,null,null,null,null,null,null,null,null,null,null,null,null,null,null,null,7,null,null,null,0,null,null,null,null,null,null,0,".07",null,null,0,0,0,"00:00:00"]
[null,null,null,null,null,null,null,null,null,null,null,null,null,null,null,null,null,null,null,null,null,null,null,null,null,null,null,null,null,null,null,null,null,null,null,null,null,null,null,null,null,null,null,null,null,null,null,null,null,8,null,null,null,0,null,null,null,null,null,null,0,".08",null,null,0,0,0,"00:00:00"]
[null,null,null,null,null,null,null,null,null,null,null,null,null,null,null,null,null,null,null,null,null,null,null,null,null,null,null,null,null,null,null,null,null,null,null,null,null,null,null,null,null,null,null,null,null,null,null,null,null,9,null,null,null,0,null,null,null,null,null,null,0,".09",null,null,0,0,0,"00:00:00"]
[null,null,null,null,null,null,null,null,null,null,null,null,null,null,null,null,null,null,null,null,null,null,null,null,null,null,null,null,null,null,null,null,null,null,null,null,null,null,null,null,null,null,null,null,null,null,null,null,null,10,null,null,null,0,null,null,null,null,null,null,0,".10",null,null,0,0,0,"00:00:00"]
{"$rows_left_out":51}
{"sheet":"Resumen","index":2,"n_rows":0,"n_cols":0,"rows_kept":0,"cut":false,"hidden":true,"merged":[[5,10,5,16],[3,188,3,189],[0,190,0,193],[1,190,1,193],[2,155,2,161],[2,162,2,169],[0,157,0,168]]}

{"sheet":"Datos","index":3,"n_rows":32,"n_cols":23,"rows_kept":32,"cut":false,"hidden":false,"merged":[[6,6,6,8],[13,12,13,15],[14,12,14,15],[4,20,4,21],[1,6,1,22],[23,6,23,8],[23,20,23,21],[2,9,2,13],[3,15,3,18],[3,9,3,13],[21,11,21,13],[21,15,21,17],[19,20,19,21],[12,20,12,21],[19,6,19,8],[12,6,12,8],[6,20,6,21]]}
[]
[null,null,null,null,{"$f":"Calculadora!$A$5","v":5}]
[null,null,null,null,null,"SELECIONAR"]
[null,null,null,null,null,null,null,null,null,null,null,null,null,null,null,null,null,null,null,null,"Periodo:",{"$f":"LOOKUP(Nomina!AW4,Nomina!AX6:AX65,Nomina!A6:A65)","v":"Enero"}]
[null,null,null,null,null,null,null,null,null,null,null,null,null,null,null,null,null,null,null,null,{"$f":"NIT","v":"NIT: 12345"}]
[]
[null,null,null,null,1,"EMPLEADO","Empleados",null,null,null,null,null,null,null,null,null,null,null,null,null,"Factor salarial",null,5]
[null,null,null,null,null,null,"Sueldo Basico",null,{"$f":"LOOKUP(Nomina!AW4,Nomina!AX6:AX65,Nomina!D6:D65)","v":950000},null,null,null,null,null,null,null,null,null,null,null,"Total Horas Extras",{"$f":"LOOKUP(Nomina!AW4,Nomina!AX6:AX65,Nomina!BI6:BI65)","v":0}]
[null,null,null,null,null,null,"Salario diá",null,{"$f":"$I$10*8","v":31666.666666666668},null,null,null,null,null,null,null,null,null,null,null,"Total Recargos",{"$f":"LOOKUP(Nomina!AW4,Nomina!AX6:AX65,Nomina!BB6:BB65)","v":0}]
[null,null,null,null,null,null,"Salario hora",null,{"$f":"$I$8/240","v":3958.3333333333335},null,null,null,null,null,null,null,null,null,null,null,"Comisones",{"$f":"LOOKUP(Nomina!AW4,Nomina!AX6:AX65,Nomina!BC6:BC65)","v":0}]
[null,null,null,null,null,null,"Auxilio de T.",null,{"$f":"LOOKUP(Nomina!AW4,Nomina!AX6:AX65,Nomina!G6:G65)","v":100000},null,null,null,null,null,null,null,null,null,null,null,"Otros Valores",{"$f":"LOOKUP(Nomina!AW4,Nomina!AX6:AX65,Nomina!BD6:BD65)","v":0}]
[]
[null,null,null,null,2,"Valor Horas Extras ","Valor Horas Extras",null,null,null,null,null,null,null,null,null,null,null,null,null,"Descuentos",null,6]
[null,null,null,null,null,null,"Ordinaria",null,{"$f":"$I$10*'D-basicos'!$C$41","v":4947.916666666667},null,null,null,{"$f":"LOOKUP(Nomina!AW4,Nomina!AX6:AX65,Nomina!B6:B65)","v":"Carolina Bargas "},null,null,null,null,null,null,null,"Aportes AFC.",{"$f":"LOOKUP(Nomina!AW4,Nomina!AX6:AX65,Nomina!AN6:AN65)","v":0}]
[null,null,null,null,null,null,"D. Ordinario",null,{"$f":"$I$10*'D-basicos'!$C$44","v":7916.666666666667},null,null,null,{"$f":"LOOKUP(Nomina!AW4,Nomina!AX6:AX65,Nomina!AK6:AK65)","v":"Analista "},null,null,null,null,null,null,null,"Prestamo",{"$f":"LOOKUP(Nomina!AW4,Nomina!AX6:AX65,Nomina!AO6:AO65)","v":0}]
{"$rows_left_out":18}
{"sheet":"Recibo","index":4,"n_rows":36,"n_cols":13,"rows_kept":36,"cut":false,"hidden":false,"merged":[[0,2,1,2],[5,8,5,9],[3,3,3,7],[38,8,38,9],[10,7,10,9],[8,4,8,6],[8,1,8,3],[5,1,5,2],[6,4,6,6],[7,4,7,6],[7,1,7,3],[6,1,6,3],[9,4,9,6],[38,4,38,5],[2,1,2,2]]}
[null,null,{"$f":"CONCATENATE(\"RECIBO DE PAGO \",B10)","v":"RECIBO DE PAGO Carolina Bargas "}]
[]
[null,{"$f":"NIT","v":"NIT: 12345"}]
[null,{"$f":"CONCATENATE(\"Detalles del Pago\", Datos!M14)","v":"Detalles del PagoCarolina Bargas "}]
[null,null,null,null,null,null,null,null,null,0]
[null,null,null,null,null,null,null,null,"PERIODO CAUSADO"]
[null,"EMPRESA",null,null,"DIRECCIÓN",null,null,"TELEFONO","DEL ","Al "]
[null,"San  JorgePlus",null,null,{"$f":"Dirección","v":"carre 30 # 44-55 Medellin"},null,null,{"$f":"Telefono","v":3345520},"2021-12-01","2021-12-15"]
[null,"EMPLEADO",null,null,{"$f":"LOOKUP(Nomina!AW4,Nomina!AX6:AX65,Nomina!BU6:BU65)","v":"CÉDULA DE CIUDADANÍA"},null,null,"PUESTO","ANTIGÜEDAD","TOTAL DIÁS"]
[null,{"$f":"Datos!M$14","v":"Carolina Bargas "},null,null,{"$f":"LOOKUP(Nomina!AW4,Nomina!AX6:AX65,Nomina!BT6:BT65)","v":"39256348"},null,null,{"$f":"Datos!$M$15","v":"Analista "},{"$f":"LOOKUP(Nomina!AW4,Nomina!AX6:AX65,Nomina!BS6:BS65)","v":"02/02/2012"},{"$f":"Datos!$M$24","v":30}]
[null,null,null,null,null,null,null,"Valor de la Operación"]
[null,"CANTIDAD",null,"CONCEPTO",null,null,null,"CANTIDAD","DEBITO","CREDITO"]
[null,25050505,"SALARIOS POR PAGAR",null,null,null,null,{"$f":"$J$10","v":30},{"$f":"Datos!$I$8","v":950000},null,null,{"$f":"$I$13","v":950000},950000]
[null,25150505,"INTERESES A LA CESANTIAS POR PAGAR",null,null,null,null,{"$f":"LOOKUP(Nomina!AW4,Nomina!AX6:AX65,Nomina!CB6:CB65)","v":0},{"$f":"LOOKUP(Nomina!AW4,Nomina!AX6:AX65,Nomina!CA6:CA65)","v":0},null,null,{"$f":"$I$14","v":0},0]
[null,25056905,"APORTES E.P.S. ",null,null,null,null,{"$f":"$J$10","v":30},0,{"$f":"Datos!$I$25","v":38000},null,{"$f":"$J$15","v":38000},38000]
{"$rows_left_out":22}
{"sheet":"Plantilla","index":5,"n_rows":84,"n_cols":19,"rows_kept":84,"cut":false,"hidden":false,"merged":[[83,1,86,8],[73,10,73,13],[80,15,80,16],[68,12,68,13],[69,12,69,13],[79,10,79,16],[75,12,75,13],[70,12,70,13],[71,12,71,13],[72,12,72,13],[74,7,74,8],[69,7,69,8],[70,7,70,8],[79,5,79,8],[65,15,65,16],[77,10,77,13],[2,8,2,9],[3,6,3,7],[77,2,77,3],[67,4,67,8],[71,7,71,8],[72,7,72,8],[67,10,67,16],[73,7,73,8],[75,7,75,8],[68,7,68,8],[77,4,77,8],[2,6,2,7],[2,14,3,14]]}
[null,null,{"$f":"CONCATENATE(Nomina!A6,\" del \",Nomina!A4)","v":"Enero del 2021"}]
[null,null,{"$f":"NIT","v":"NIT: 12345"}]
[null,null,"San  JorgePlus",null,null,null,null,null,null,null,null,null,null,null,null,"Desde:","2021-02-01"]
[null,null,null,null,null,null,0,null,null,null,null,null,null,null,null,"Hasta:","2021-02-01"]
[null,"Nº","EMPLEADO                                            Nombre y Apellido","Salario  Base","Lab","Liq","                  Basico","Aux. Transporte","H.E","Comisiones"," Devengado","Salud","Pension","Otras "," Deduciones"," Pagado","(Firma y CC)",null,5]
[null,1,{"$f":"IF(Nomina!B6=\"\",0,Nomina!B6)","v":"Carolina Bargas "},{"$f":"IF(Nomina!D6=\"\",0,Nomina!D6)","v":950000},{"$f":"IF(Nomina!AJ6=\"\",0,Nomina!AJ6)","v":30},{"$f":"IF(Nomina!E6=\"\",0,Nomina!E6)","v":30},{"$f":"IF(Nomina!F6=\"\",0,Nomina!F6)","v":950000},{"$f":"IF(Nomina!G6=\"\",0,Nomina!G6)","v":100000},{"$f":"IF(Nomina!BI6=\"\",0,Nomina!BI6)","v":0},{"$f":"IF(Nomina!BC6=\"\",0,Nomina!BC6)","v":0},{"$f":"IF(Nomina!Q6=\"\",0,Nomina!Q6)","v":1050000},{"$f":"IF(Nomina!R6=\"\",0,Nomina!R6)","v":38000},{"$f":"IF(Nomina!R6=\"\",0,Nomina!S6)","v":38000},{"$f":"IF(Nomina!V6=\"\",0,Nomina!V6)","v":0},{"$f":"IF(Nomina!W6=\"\",0,Nomina!W6)","v":76000},{"$f":"IF(Nomina!X6=\"\",0,Nomina!X6)","v":974000}]
[null,2,{"$f":"IF(Nomina!B7=\"\",0,Nomina!B7)","v":"Yeny Bastidas"},{"$f":"IF(Nomina!D7=\"\",0,Nomina!D7)","v":1000000},{"$f":"IF(Nomina!AJ7=\"\",0,Nomina!AJ7)","v":30},{"$f":"IF(Nomina!E7=\"\",0,Nomina!E7)","v":30},{"$f":"IF(Nomina!F7=\"\",0,Nomina!F7)","v":1000000},{"$f":"IF(Nomina!G7=\"\",0,Nomina!G7)","v":97032},{"$f":"IF(Nomina!BI7=\"\",0,Nomina!BI7)","v":50000},{"$f":"IF(Nomina!BC7=\"\",0,Nomina!BC7)","v":100000},{"$f":"IF(Nomina!Q7=\"\",0,Nomina!Q7)","v":1206454},{"$f":"IF(Nomina!R7=\"\",0,Nomina!R7)","v":44000},{"$f":"IF(Nomina!R7=\"\",0,Nomina!S7)","v":44000},{"$f":"IF(Nomina!V7=\"\",0,Nomina!V7)","v":0},{"$f":"IF(Nomina!W7=\"\",0,Nomina!W7)","v":88000},{"$f":"IF(Nomina!X7=\"\",0,Nomina!X7)","v":1118454}]
[null,3,{"$f":"IF(Nomina!B8=\"\",0,Nomina!B8)","v":"Yeny Bastidas"},{"$f":"IF(Nomina!D8=\"\",0,Nomina!D8)","v":1000000},{"$f":"IF(Nomina!AJ8=\"\",0,Nomina!AJ8)","v":30},{"$f":"IF(Nomina!E8=\"\",0,Nomina!E8)","v":30},{"$f":"IF(Nomina!F8=\"\",0,Nomina!F8)","v":1000000},{"$f":"IF(Nomina!G8=\"\",0,Nomina!G8)","v":106454},{"$f":"IF(Nomina!BI8=\"\",0,Nomina!BI8)","v":16875.000000000004},{"$f":"IF(Nomina!BC8=\"\",0,Nomina!BC8)","v":40000},{"$f":"IF(Nomina!Q8=\"\",0,Nomina!Q8)","v":1163329},{"$f":"IF(Nomina!R8=\"\",0,Nomina!R8)","v":42275},{"$f":"IF(Nomina!R8=\"\",0,Nomina!S8)","v":42275},{"$f":"IF(Nomina!V8=\"\",0,Nomina!V8)","v":0},{"$f":"IF(Nomina!W8=\"\",0,Nomina!W8)","v":84550},{"$f":"IF(Nomina!X8=\"\",0,Nomina!X8)","v":1078779}]
[null,4,{"$f":"IF(Nomina!B9=\"\",0,Nomina!B9)","v":"Yeny Bastidas"},{"$f":"IF(Nomina!D9=\"\",0,Nomina!D9)","v":1000000},{"$f":"IF(Nomina!AJ9=\"\",0,Nomina!AJ9)","v":30},{"$f":"IF(Nomina!E9=\"\",0,Nomina!E9)","v":30},{"$f":"IF(Nomina!F9=\"\",0,Nomina!F9)","v":1000000},{"$f":"IF(Nomina!G9=\"\",0,Nomina!G9)","v":106454},{"$f":"IF(Nomina!BI9=\"\",0,Nomina!BI9)","v":16875.000000000004},{"$f":"IF(Nomina!BC9=\"\",0,Nomina!BC9)","v":100000},{"$f":"IF(Nomina!Q9=\"\",0,Nomina!Q9)","v":1223329},{"$f":"IF(Nomina!R9=\"\",0,Nomina!R9)","v":44675},{"$f":"IF(Nomina!R9=\"\",0,Nomina!S9)","v":44675},{"$f":"IF(Nomina!V9=\"\",0,Nomina!V9)","v":0},{"$f":"IF(Nomina!W9=\"\",0,Nomina!W9)","v":89350},{"$f":"IF(Nomina!X9=\"\",0,Nomina!X9)","v":1133979}]
[null,5,{"$f":"IF(Nomina!B10=\"\",0,Nomina!B10)","v":0},{"$f":"IF(Nomina!D10=\"\",0,Nomina!D10)","v":0},{"$f":"IF(Nomina!AJ10=\"\",0,Nomina!AJ10)","v":0},{"$f":"IF(Nomina!E10=\"\",0,Nomina!E10)","v":0},{"$f":"IF(Nomina!F10=\"\",0,Nomina!F10)","v":0},{"$f":"IF(Nomina!G10=\"\",0,Nomina!G10)","v":0},{"$f":"IF(Nomina!BI10=\"\",0,Nomina!BI10)","v":0},{"$f":"IF(Nomina!BC10=\"\",0,Nomina!BC10)","v":0},{"$f":"IF(Nomina!Q10=\"\",0,Nomina!Q10)","v":0},{"$f":"IF(Nomina!R10=\"\",0,Nomina!R10)","v":0},{"$f":"IF(Nomina!R10=\"\",0,Nomina!S10)","v":0},{"$f":"IF(Nomina!V10=\"\",0,Nomina!V10)","v":0},{"$f":"IF(Nomina!W10=\"\",0,Nomina!W10)","v":0},{"$f":"IF(Nomina!X10=\"\",0,Nomina!X10)","v":0}]
[null,6,{"$f":"IF(Nomina!B11=\"\",0,Nomina!B11)","v":0},{"$f":"IF(Nomina!D11=\"\",0,Nomina!D11)","v":0},{"$f":"IF(Nomina!AJ11=\"\",0,Nomina!AJ11)","v":0},{"$f":"IF(Nomina!E11=\"\",0,Nomina!E11)","v":0},{"$f":"IF(Nomina!F11=\"\",0,Nomina!F11)","v":0},{"$f":"IF(Nomina!G11=\"\",0,Nomina!G11)","v":0},{"$f":"IF(Nomina!BI11=\"\",0,Nomina!BI11)","v":0},{"$f":"IF(Nomina!BC11=\"\",0,Nomina!BC11)","v":0},{"$f":"IF(Nomina!Q11=\"\",0,Nomina!Q11)","v":0},{"$f":"IF(Nomina!R11=\"\",0,Nomina!R11)","v":0},{"$f":"IF(Nomina!R11=\"\",0,Nomina!S11)","v":0},{"$f":"IF(Nomina!V11=\"\",0,Nomina!V11)","v":0},{"$f":"IF(Nomina!W11=\"\",0,Nomina!W11)","v":0},{"$f":"IF(Nomina!X11=\"\",0,Nomina!X11)","v":0}]
[null,7,{"$f":"IF(Nomina!B12=\"\",0,Nomina!B12)","v":0},{"$f":"IF(Nomina!D12=\"\",0,Nomina!D12)","v":0},{"$f":"IF(Nomina!AJ12=\"\",0,Nomina!AJ12)","v":0},{"$f":"IF(Nomina!E12=\"\",0,Nomina!E12)","v":0},{"$f":"IF(Nomina!F12=\"\",0,Nomina!F12)","v":0},{"$f":"IF(Nomina!G12=\"\",0,Nomina!G12)","v":0},{"$f":"IF(Nomina!BI12=\"\",0,Nomina!BI12)","v":0},{"$f":"IF(Nomina!BC12=\"\",0,Nomina!BC12)","v":0},{"$f":"IF(Nomina!Q12=\"\",0,Nomina!Q12)","v":0},{"$f":"IF(Nomina!R12=\"\",0,Nomina!R12)","v":0},{"$f":"IF(Nomina!R12=\"\",0,Nomina!S12)","v":0},{"$f":"IF(Nomina!V12=\"\",0,Nomina!V12)","v":0},{"$f":"IF(Nomina!W12=\"\",0,Nomina!W12)","v":0},{"$f":"IF(Nomina!X12=\"\",0,Nomina!X12)","v":0}]
[null,8,{"$f":"IF(Nomina!B13=\"\",0,Nomina!B13)","v":0},{"$f":"IF(Nomina!D13=\"\",0,Nomina!D13)","v":0},{"$f":"IF(Nomina!AJ13=\"\",0,Nomina!AJ13)","v":0},{"$f":"IF(Nomina!E13=\"\",0,Nomina!E13)","v":0},{"$f":"IF(Nomina!F13=\"\",0,Nomina!F13)","v":0},{"$f":"IF(Nomina!G13=\"\",0,Nomina!G13)","v":0},{"$f":"IF(Nomina!BI13=\"\",0,Nomina!BI13)","v":0},{"$f":"IF(Nomina!BC13=\"\",0,Nomina!BC13)","v":0},{"$f":"IF(Nomina!Q13=\"\",0,Nomina!Q13)","v":0},{"$f":"IF(Nomina!R13=\"\",0,Nomina!R13)","v":0},{"$f":"IF(Nomina!R13=\"\",0,Nomina!S13)","v":0},{"$f":"IF(Nomina!V13=\"\",0,Nomina!V13)","v":0},{"$f":"IF(Nomina!W13=\"\",0,Nomina!W13)","v":0},{"$f":"IF(Nomina!X13=\"\",0,Nomina!X13)","v":0}]
[null,9,{"$f":"IF(Nomina!B14=\"\",0,Nomina!B14)","v":0},{"$f":"IF(Nomina!D14=\"\",0,Nomina!D14)","v":0},{"$f":"IF(Nomina!AJ14=\"\",0,Nomina!AJ14)","v":0},{"$f":"IF(Nomina!E14=\"\",0,Nomina!E14)","v":0},{"$f":"IF(Nomina!F14=\"\",0,Nomina!F14)","v":0},{"$f":"IF(Nomina!G14=\"\",0,Nomina!G14)","v":0},{"$f":"IF(Nomina!BI14=\"\",0,Nomina!BI14)","v":0},{"$f":"IF(Nomina!BC14=\"\",0,Nomina!BC14)","v":0},{"$f":"IF(Nomina!Q14=\"\",0,Nomina!Q14)","v":0},{"$f":"IF(Nomina!R14=\"\",0,Nomina!R14)","v":0},{"$f":"IF(Nomina!R14=\"\",0,Nomina!S14)","v":0},{"$f":"IF(Nomina!V14=\"\",0,Nomina!V14)","v":0},{"$f":"IF(Nomina!W14=\"\",0,Nomina!W14)","v":0},{"$f":"IF(Nomina!X14=\"\",0,Nomina!X14)","v":0}]
[null,10,{"$f":"IF(Nomina!B15=\"\",0,Nomina!B15)","v":0},{"$f":"IF(Nomina!D15=\"\",0,Nomina!D15)","v":0},{"$f":"IF(Nomina!AJ15=\"\",0,Nomina!AJ15)","v":0},{"$f":"IF(Nomina!E15=\"\",0,Nomina!E15)","v":0},{"$f":"IF(Nomina!F15=\"\",0,Nomina!F15)","v":0},{"$f":"IF(Nomina!G15=\"\",0,Nomina!G15)","v":0},{"$f":"IF(Nomina!BI15=\"\",0,Nomina!BI15)","v":0},{"$f":"IF(Nomina!BC15=\"\",0,Nomina!BC15)","v":0},{"$f":"IF(Nomina!Q15=\"\",0,Nomina!Q15)","v":0},{"$f":"IF(Nomina!R15=\"\",0,Nomina!R15)","v":0},{"$f":"IF(Nomina!R15=\"\",0,Nomina!S15)","v":0},{"$f":"IF(Nomina!V15=\"\",0,Nomina!V15)","v":0},{"$f":"IF(Nomina!W15=\"\",0,Nomina!W15)","v":0},{"$f":"IF(Nomina!X15=\"\",0,Nomina!X15)","v":0}]
{"$rows_left_out":70}
{"sheet":"D-basicos","index":6,"n_rows":86,"n_cols":5,"rows_kept":86,"cut":false,"hidden":false,"merged":[[10,17,11,17],[12,17,12,18],[13,17,13,18],[0,0,0,22],[1,0,1,3],[2,0,2,3],[6,0,6,3],[12,0,12,3],[80,0,80,4],[84,0,85,0],[57,0,57,3],[60,0,60,3],[17,0,17,3],[26,0,26,3],[38,0,38,3],[47,0,47,3],[53,0,53,3]]}
[]
["DATOS BASICOS ACTUALES  NOMINA - 2021"]
["SALARIO MINIMO Y AUXILIO DE TRANSPORTE",null,null,null,1]
["Salario Minimo=",908526]
["Auxilio de Transporte=",106454]
[]
["CARGAS PRESTACIONALES",null,null,null,2]
["Cesantias=",8.3299999999999999E-2]
["Prima de Servicios=",8.3299999999999999E-2]
["Ints/Cesantias=",null,0.12]
["Vacaciones=",4.1700000000000001E-2]
[]
["SEGURIDAD SOCIAL Y PENSION",null,null,null,3]
[null,"Empleado","Empresa"]
["Salud=",0.04,8.5000000000000006E-2]
{"$rows_left_out":72}
{"sheet":"Hoja1","index":7,"n_rows":0,"n_cols":0,"rows_kept":0,"cut":false,"hidden":false,"merged":[]}